Target
Tyrosine-protein kinase Lck
Ligand
BDBM340141
Substrate
Meas. Tech.
Lck Enzyme Activity
EC50
>1000±n/a nM
Citation
 Barf, TAJans, CGde Man, APOubrie, AARaaijmakers, HCRewinkel, JBSterrenburg, JGWijkmans, JC 4-imidazopyridazin-1-yl-benzamides as Btk inhibitors US Patent  US9758524 Publication Date 9/12/2017 
Target
Name:
Tyrosine-protein kinase Lck
Synonyms:
2.7.10.2 LCK_HUMAN Leukocyte C-terminal Src kinase Lymphocyte-specific protein tyrosine kinase Protein YT16 Proto-oncogene tyrosine-protein kinase LCK T cell-specific protein-tyrosine kinase
Type:
Mol. Mass.:
57987.83
Organism:
Homo sapiens (Human)
Description:
P06239
Residue:
509
  
Inhibitor
Name:
BDBM340141
Synonyms:
US10239883, Example 30 US9758524, Example 30
Type:
Small organic molecule
Emp. Form.:
C24H21N7O2
Mol. Mass.:
439.4692
SMILES:
CC#CC(=O)N[C@@H](C)c1nc(-c2ccc(cc2)C(=O)Nc2ccccn2)c2c(N)nccn12
: