Target
Tyrosine-protein kinase Lck
Ligand
BDBM340188
Substrate
Meas. Tech.
Lck Enzyme Activity
EC50
550±n/a nM
Citation
 Barf, TAJans, CGde Man, APOubrie, AARaaijmakers, HCRewinkel, JBSterrenburg, JGWijkmans, JC 4-imidazopyridazin-1-yl-benzamides as Btk inhibitors US Patent  US9758524 Publication Date 9/12/2017 
Target
Name:
Tyrosine-protein kinase Lck
Synonyms:
2.7.10.2 LCK_HUMAN Leukocyte C-terminal Src kinase Lymphocyte-specific protein tyrosine kinase Protein YT16 Proto-oncogene tyrosine-protein kinase LCK T cell-specific protein-tyrosine kinase
Type:
Mol. Mass.:
57987.83
Organism:
Homo sapiens (Human)
Description:
P06239
Residue:
509
  
Inhibitor
Name:
BDBM340188
Synonyms:
(S)-4-(3-(1-acryloylpyrrolidin-2-yl)- 8-aminoimidazo[1,5-a]pyrazin-1-yl)- N-(4-propylpyridin-2-yl)benzamide US10934296, Example 125 | US9758524, Example 125
Type:
Small organic molecule
Emp. Form.:
C28H29N7O2
Mol. Mass.:
495.5756
SMILES:
CCCc1ccnc(NC(=O)c2ccc(cc2)-c2nc([C@@H]3CCCN3C(=O)C=C)n3ccnc(N)c23)c1
: