Target
Proto-oncogene tyrosine-protein kinase Src
Ligand
BDBM340155
Substrate
Meas. Tech.
Src Enzyme Activity
EC50
>1000±n/a nM
Citation
 Barf, TAJans, CGde Man, APOubrie, AARaaijmakers, HCRewinkel, JBSterrenburg, JGWijkmans, JC 4-imidazopyridazin-1-yl-benzamides as Btk inhibitors US Patent  US9758524 Publication Date 9/12/2017 
Target
Name:
Proto-oncogene tyrosine-protein kinase Src
Synonyms:
Calmodulin/Proto-oncogene tyrosine-protein kinase Src Proto-oncogene c-Src SRC SRC_HUMAN V-src sarcoma (Schmidt-Ruppin A-2) viral oncogene homolog (avian) p60-Src | pp60c-src
Type:
Protein
Mol. Mass.:
59838.60
Organism:
Homo sapiens (Human)
Description:
P12931
Residue:
536
  
Inhibitor
Name:
BDBM340155
Synonyms:
(S)-4-(3-(1-acryloylpiperidin-2-yl)-8- aminoimidazo[1,5-a]pyrazin-1-yl)- N-(pyridin-2-yl)benzamide US10934296, Example 46 | US9758524, Example 46
Type:
Small organic molecule
Emp. Form.:
C26H25N7O2
Mol. Mass.:
467.5224
SMILES:
Nc1nccn2c(nc(-c3ccc(cc3)C(=O)Nc3ccccn3)c12)[C@@H]1CCCCN1C(=O)C=C
: