Target
Proto-oncogene tyrosine-protein kinase Src
Ligand
BDBM340095
Substrate
Meas. Tech.
Src Enzyme Activity
EC50
>1000±n/a nM
Citation
 Barf, TAJans, CGde Man, APOubrie, AARaaijmakers, HCRewinkel, JBSterrenburg, JGWijkmans, JC 4-imidazopyridazin-1-yl-benzamides as Btk inhibitors US Patent  US9758524 Publication Date 9/12/2017 
Target
Name:
Proto-oncogene tyrosine-protein kinase Src
Synonyms:
Calmodulin/Proto-oncogene tyrosine-protein kinase Src Proto-oncogene c-Src SRC SRC_HUMAN V-src sarcoma (Schmidt-Ruppin A-2) viral oncogene homolog (avian) p60-Src | pp60c-src
Type:
Protein
Mol. Mass.:
59838.60
Organism:
Homo sapiens (Human)
Description:
P12931
Residue:
536
  
Inhibitor
Name:
BDBM340095
Synonyms:
(S)-4-(8-amino-3-(1-but-2- ynoylpyrrolidin-2-yl)imidazo[1,5- a]pyrazin-1-yl)-N-(thiazol-2- yl)benzamide US10934296, Example 60 | US9758524, Example 60
Type:
Small organic molecule
Emp. Form.:
C24H21N7O2S
Mol. Mass.:
471.534
SMILES:
CC#CC(=O)N1CCC[C@H]1c1nc(-c2ccc(cc2)C(=O)Nc2nccs2)c2c(N)nccn12
: