Target
Tyrosine-protein kinase Fyn
Ligand
BDBM340083
Substrate
Meas. Tech.
FynT Enzyme Activity
EC50
>1000±n/a nM
Citation
 Barf, TAJans, CGde Man, APOubrie, AARaaijmakers, HCRewinkel, JBSterrenburg, JGWijkmans, JC 4-imidazopyridazin-1-yl-benzamides as Btk inhibitors US Patent  US9758524 Publication Date 9/12/2017 
Target
Name:
Tyrosine-protein kinase Fyn
Synonyms:
FYN Proto-oncogene Syn SLK Src-like kinase | p59-Fyn
Type:
Enzyme
Mol. Mass.:
60762.21
Organism:
Homo sapiens (Human)
Description:
P06241
Residue:
537
  
Inhibitor
Name:
BDBM340083
Synonyms:
US10239883, Example 7 US9758524, Example 7
Type:
Small organic molecule
Emp. Form.:
C28H29FN8O2
Mol. Mass.:
528.5807
SMILES:
CN(C)C\C=C\C(=O)N1CCC[C@H]1c1nc(-c2ccc(cc2)C(=O)Nc2cc(F)ccn2)c2c(N)nccn12
: