Target
Tyrosine-protein kinase Fyn
Ligand
BDBM340133
Substrate
Meas. Tech.
FynT Enzyme Activity
EC50
>1000±n/a nM
Citation
 Barf, TAJans, CGde Man, APOubrie, AARaaijmakers, HCRewinkel, JBSterrenburg, JGWijkmans, JC 4-imidazopyridazin-1-yl-benzamides as Btk inhibitors US Patent  US9758524 Publication Date 9/12/2017 
Target
Name:
Tyrosine-protein kinase Fyn
Synonyms:
FYN Proto-oncogene Syn SLK Src-like kinase | p59-Fyn
Type:
Enzyme
Mol. Mass.:
60762.21
Organism:
Homo sapiens (Human)
Description:
P06241
Residue:
537
  
Inhibitor
Name:
BDBM340133
Synonyms:
US10239883, Example 21 US9758524, Example 21
Type:
Small organic molecule
Emp. Form.:
C26H26N8O2
Mol. Mass.:
482.537
SMILES:
Cc1ccnc(NC(=O)c2ccc(cc2)-c2nc([C@@H]3CCCCN3C(=O)C=C)n3ccnc(N)c23)n1
: