Target
Tyrosine-protein kinase Fyn
Ligand
BDBM340137
Substrate
Meas. Tech.
FynT Enzyme Activity
EC50
>1000±n/a nM
Citation
 Barf, TAJans, CGde Man, APOubrie, AARaaijmakers, HCRewinkel, JBSterrenburg, JGWijkmans, JC 4-imidazopyridazin-1-yl-benzamides as Btk inhibitors US Patent  US9758524 Publication Date 9/12/2017 
Target
Name:
Tyrosine-protein kinase Fyn
Synonyms:
FYN Proto-oncogene Syn SLK Src-like kinase | p59-Fyn
Type:
Enzyme
Mol. Mass.:
60762.21
Organism:
Homo sapiens (Human)
Description:
P06241
Residue:
537
  
Inhibitor
Name:
BDBM340137
Synonyms:
US10239883, Example 26 US9758524, Example 26
Type:
Small organic molecule
Emp. Form.:
C29H30FN7O2
Mol. Mass.:
527.5926
SMILES:
CCCc1ccnc(NC(=O)c2ccc(cc2F)-c2nc([C@@H]3CCCCN3C(=O)C=C)n3ccnc(N)c23)c1
: