Target
Tyrosine-protein kinase Fyn
Ligand
BDBM340164
Substrate
Meas. Tech.
FynT Enzyme Activity
EC50
>1000±n/a nM
Citation
 Barf, TAJans, CGde Man, APOubrie, AARaaijmakers, HCRewinkel, JBSterrenburg, JGWijkmans, JC 4-imidazopyridazin-1-yl-benzamides as Btk inhibitors US Patent  US9758524 Publication Date 9/12/2017 
Target
Name:
Tyrosine-protein kinase Fyn
Synonyms:
FYN Proto-oncogene Syn SLK Src-like kinase | p59-Fyn
Type:
Enzyme
Mol. Mass.:
60762.21
Organism:
Homo sapiens (Human)
Description:
P06241
Residue:
537
  
Inhibitor
Name:
BDBM340164
Synonyms:
4-(8-amino-3-((S)-1- (vinylsulfonyl)piperidin-2- yl)imidazo[1,5-a]pyrazin-1-yl)-3- methyl-N-(pyridin-2-yl)benzamide US10934296, Example 66 | US9758524, Example 66
Type:
Small organic molecule
Emp. Form.:
C26H27N7O3S
Mol. Mass.:
517.603
SMILES:
Cc1cc(ccc1-c1nc([C@@H]2CCCCN2S(=O)(=O)C=C)n2ccnc(N)c12)C(=O)Nc1ccccn1
: