Target
Complement factor D
Ligand
BDBM340120
Substrate
Meas. Tech.
Inhibition Assay
IC50
<1000±n/a nM
Citation
 Wiles, JAPhadke, ASWang, XChen, DHashimoto, AGadhachanda, VRPais, GWang, QAgarwal, ADeshpande, M Compounds for treatment of complement mediated disorders US Patent  US9758537 Publication Date 9/12/2017 
Target
Name:
Complement factor D
Synonyms:
Adipsin CFAD_HUMAN DF Properdin factor D
Type:
Protein
Mol. Mass.:
27039.19
Organism:
Homo sapiens (Human)
Description:
P00746
Residue:
253
  
Inhibitor
Name:
BDBM340120
Synonyms:
(2S,3aS,7aS)-1-(2-(3- acetyl-1H-indol-1- yl)acetyl)-N-(3-chloro- 2- fluorobenzyl)octahydro- 1H-indole-2- carboxamide | US9758537, Compound 1
Type:
Small organic molecule
Emp. Form.:
C28H29ClFN3O3
Mol. Mass.:
510
SMILES:
CC(=O)c1cn(CC(=O)N2[C@@H](C[C@@H]3CCCC[C@H]23)C(=O)NCc2cccc(Cl)c2F)c2ccccc12
: