Target
Complement factor D
Ligand
BDBM340218
Substrate
Meas. Tech.
Inhibition Assay
IC50
<1000±n/a nM
Citation
 Wiles, JAPhadke, ASWang, XChen, DHashimoto, AGadhachanda, VRPais, GWang, QAgarwal, ADeshpande, M Compounds for treatment of complement mediated disorders US Patent  US9758537 Publication Date 9/12/2017 
Target
Name:
Complement factor D
Synonyms:
Adipsin CFAD_HUMAN DF Properdin factor D
Type:
Protein
Mol. Mass.:
27039.19
Organism:
Homo sapiens (Human)
Description:
P00746
Residue:
253
  
Inhibitor
Name:
BDBM340218
Synonyms:
(2S,3S,4S)-1-(2-(3- acetyl-6-hydroxy-1H- indol-1-yl)acetyl)-N-(3- chloro-2-fluorobenzyl)- 3- (cyclopropylmethoxy)- 4-fluoropyrrolidine-2- carboxamide | US9758537, Compound 21
Type:
Small organic molecule
Emp. Form.:
C28H28ClF2N3O5
Mol. Mass.:
559.989
SMILES:
CC(=O)c1cn(CC(=O)N2C[C@H](F)[C@@H](OCC3CC3)[C@H]2C(=O)NCc2cccc(Cl)c2F)c2cc(O)ccc12
: