Target
Complement factor D
Ligand
BDBM340248
Substrate
Meas. Tech.
Inhibition Assay
IC50
>10000±n/a nM
Citation
 Wiles, JAPhadke, ASWang, XChen, DHashimoto, AGadhachanda, VRPais, GWang, QAgarwal, ADeshpande, M Compounds for treatment of complement mediated disorders US Patent  US9758537 Publication Date 9/12/2017 
Target
Name:
Complement factor D
Synonyms:
Adipsin CFAD_HUMAN DF Properdin factor D
Type:
Protein
Mol. Mass.:
27039.19
Organism:
Homo sapiens (Human)
Description:
P00746
Residue:
253
  
Inhibitor
Name:
BDBM340248
Synonyms:
(2S,4R)-1-(6- acetamidonicotinoyl)- N-(3-chloro-2- fluorobenzyl)-4- fluoropyrrolidine-2- carboxamide | US9758537, Compound 51
Type:
Small organic molecule
Emp. Form.:
C20H19ClF2N4O3
Mol. Mass.:
436.84
SMILES:
CC(=O)Nc1ccc(cn1)C(=O)N1C[C@H](F)C[C@H]1C(=O)NCc1cccc(Cl)c1F
: