Target
Complement factor D
Ligand
BDBM340309
Substrate
Meas. Tech.
Inhibition Assay
IC50
<1000±n/a nM
Citation
 Wiles, JAPhadke, ASWang, XChen, DHashimoto, AGadhachanda, VRPais, GWang, QAgarwal, ADeshpande, M Compounds for treatment of complement mediated disorders US Patent  US9758537 Publication Date 9/12/2017 
Target
Name:
Complement factor D
Synonyms:
Adipsin CFAD_HUMAN DF Properdin factor D
Type:
Protein
Mol. Mass.:
27039.19
Organism:
Homo sapiens (Human)
Description:
P00746
Residue:
253
  
Inhibitor
Name:
BDBM340309
Synonyms:
1-(2-((2S,4R)-2-(3-(4- chloro-1H- benzo[d]imidazol-5-yl)-2- fluorophenylcarbamoyl)- 4-fluoropyrrolidin-1- yl)-2-oxoethyl)-1H- indazole-3-carboxamide | US9758537, Compound 122
Type:
Small organic molecule
Emp. Form.:
C28H22ClF2N7O3
Mol. Mass.:
577.969
SMILES:
NC(=O)c1nn(CC(=O)N2C[C@H](F)C[C@H]2C(=O)Nc2cccc(c2F)-c2ccc3[nH]cnc3c2Cl)c2ccccc12
: