Target
Phosphatidylinositol 3-kinase regulatory subunit alpha
Ligand
BDBM340396
Substrate
Meas. Tech.
Biochemical Assay
Ki
0.445±n/a nM
Citation
 Chen, PCheng, HGallego, GMJalaie, MKath, JCOrr, STPairish, MA Pyrimidine derivatives US Patent  US9758538 Publication Date 9/12/2017 
Target
Name:
Phosphatidylinositol 3-kinase regulatory subunit alpha
Synonyms:
GRB1 PI3-kinase class I PI3-kinase p85-alpha subunit PI3-kinase subunit p85-alpha PIK3CG/PIK3R1 Phosphatidylinositol 3-kinase 85 kDa regulatory subunit alpha (PI3K alpha) Phosphatidylinositol 3-kinase regulatory subunit alpha (PIK3R1) Phosphatidylinositol 3-kinase regulatory subunit alpha isoform 1 (PI3 Kinase alpha) Phosphatidylinositol 4,5-bisphosphate 3-kinase catalytic subunit alpha isoform (PI3Kalpha) PtdIns-3-kinase p85-alpha p85 alpha
Type:
Protein
Mol. Mass.:
83592.82
Organism:
Homo sapiens (Human)
Description:
P27986
Residue:
724
  
Inhibitor
Name:
BDBM340396
Synonyms:
US9758538, Example 84
Type:
Small organic molecule
Emp. Form.:
C23H33N9O3
Mol. Mass.:
483.5666
SMILES:
CN1CCCC(N2CC[C@@](CO)(C2)Nc2cc(nc(n2)N2CCOCC2)-c2cnc(N)nc2)C1=O
: