Target
CREB-binding protein
Ligand
BDBM340515
Substrate
Meas. Tech.
TR-FRET Binding Assay
IC50
40.0±n/a nM
Citation
 Adler, MAlbrecht, BKBronner, SChen, KXCôté, ACrawford, TCyr, PEgen, JKauder, SLai, KWLiao, JMagnuson, SMurray, JPastor, RRomero, FATaylor, AMTsui, VHWang, FZhu, B Therapeutic compounds and uses thereof US Patent  US9763922 Publication Date 9/19/2017 
Target
Name:
CREB-binding protein
Synonyms:
CBP CREB-binding protein (CBP) CREBBP
Type:
Transcription Coactivator
Mol. Mass.:
265411.66
Organism:
Homo sapiens (Human)
Description:
Q92793
Residue:
2442
  
Inhibitor
Name:
BDBM340515
Synonyms:
US9763922, Example 46
Type:
Small organic molecule
Emp. Form.:
C19H24N4O3S
Mol. Mass.:
388.484
SMILES:
CC(=O)N1CCc2c(C1)c(Nc1cccc(c1)S(C)(=O)=O)nn2CC1CC1
: