Target
CREB-binding protein
Ligand
BDBM340550
Substrate
Meas. Tech.
TR-FRET Binding Assay
IC50
20.0±n/a nM
Citation
 Adler, MAlbrecht, BKBronner, SChen, KXCôté, ACrawford, TCyr, PEgen, JKauder, SLai, KWLiao, JMagnuson, SMurray, JPastor, RRomero, FATaylor, AMTsui, VHWang, FZhu, B Therapeutic compounds and uses thereof US Patent  US9763922 Publication Date 9/19/2017 
Target
Name:
CREB-binding protein
Synonyms:
CBP CREB-binding protein (CBP) CREBBP
Type:
Transcription Coactivator
Mol. Mass.:
265411.66
Organism:
Homo sapiens (Human)
Description:
Q92793
Residue:
2442
  
Inhibitor
Name:
BDBM340550
Synonyms:
1-[1-methyl-3-(3-thiazol-5-yl-anilino)-6,7-dihydro-4H-pyrazolo[4,3-c]pyridin-5-yl]ethanone | US9763922, Example 80
Type:
Small organic molecule
Emp. Form.:
C18H19N5OS
Mol. Mass.:
353.441
SMILES:
CC(=O)N1CCc2c(C1)c(Nc1cccc(c1)-c1cncs1)nn2C
: