Target
Bromodomain-containing protein 4
Ligand
BDBM340713
Substrate
Meas. Tech.
AlphaLisa Binding Assay
IC50
5070±n/a nM
Citation
 Adler, MAlbrecht, BKBronner, SChen, KXCôté, ACrawford, TCyr, PEgen, JKauder, SLai, KWLiao, JMagnuson, SMurray, JPastor, RRomero, FATaylor, AMTsui, VHWang, FZhu, B Therapeutic compounds and uses thereof US Patent  US9763922 Publication Date 9/19/2017 
Target
Name:
Bromodomain-containing protein 4
Synonyms:
BRD4 Bromodomain-containing protein 4 (BRD4) Protein HUNK1
Type:
Protein
Mol. Mass.:
152264.84
Organism:
Homo sapiens (Human)
Description:
O60885
Residue:
1362
  
Inhibitor
Name:
BDBM340713
Synonyms:
US9763922, Example 239
Type:
Small organic molecule
Emp. Form.:
C23H24FN7O2
Mol. Mass.:
449.4808
SMILES:
CC(=O)N1CCc2c(C1)c(Nc1cc(C#N)c(cc1F)-c1cnn(C)c1)nn2C1CCOC1
: