Target
CREB-binding protein
Ligand
BDBM340739
Substrate
Meas. Tech.
TR-FRET Binding Assay
IC50
5.00±n/a nM
Citation
 Adler, MAlbrecht, BKBronner, SChen, KXCôté, ACrawford, TCyr, PEgen, JKauder, SLai, KWLiao, JMagnuson, SMurray, JPastor, RRomero, FATaylor, AMTsui, VHWang, FZhu, B Therapeutic compounds and uses thereof US Patent  US9763922 Publication Date 9/19/2017 
Target
Name:
CREB-binding protein
Synonyms:
CBP CREB-binding protein (CBP) CREBBP
Type:
Transcription Coactivator
Mol. Mass.:
265411.66
Organism:
Homo sapiens (Human)
Description:
Q92793
Residue:
2442
  
Inhibitor
Name:
BDBM340739
Synonyms:
US9763922, Example 265
Type:
Small organic molecule
Emp. Form.:
C24H27F4N7O2
Mol. Mass.:
521.5105
SMILES:
CNC(=O)N1CCc2c(C1)c(Nc1ccc(cc1F)-c1cn(C)nc1C(F)(F)F)nn2C1CCOCC1
: