Target
CREB-binding protein
Ligand
BDBM340747
Substrate
Meas. Tech.
TR-FRET Binding Assay
IC50
2.00±n/a nM
Citation
 Adler, MAlbrecht, BKBronner, SChen, KXCôté, ACrawford, TCyr, PEgen, JKauder, SLai, KWLiao, JMagnuson, SMurray, JPastor, RRomero, FATaylor, AMTsui, VHWang, FZhu, B Therapeutic compounds and uses thereof US Patent  US9763922 Publication Date 9/19/2017 
Target
Name:
CREB-binding protein
Synonyms:
CBP CREB-binding protein (CBP) CREBBP
Type:
Transcription Coactivator
Mol. Mass.:
265411.66
Organism:
Homo sapiens (Human)
Description:
Q92793
Residue:
2442
  
Inhibitor
Name:
BDBM340747
Synonyms:
3-[5-(difluoromethyl)-2-fluoro-4-(1-methylpyrazol-4-yl)anilino]-1-(1,1-dioxothian-4-yl)-N-methyl-6,7-dihydro-4H-pyrazolo[4,3-c]pyridine-5-carboxamide | US9763922, Example 273
Type:
Small organic molecule
Emp. Form.:
C24H28F3N7O3S
Mol. Mass.:
551.584
SMILES:
CNC(=O)N1CCc2c(C1)c(Nc1cc(C(F)F)c(cc1F)-c1cnn(C)c1)nn2C1CCS(=O)(=O)CC1
: