Target
High affinity nerve growth factor receptor
Ligand
BDBM249319
Substrate
Meas. Tech.
Inhibtion Assay
IC50
3.00±n/a nM
Citation
 Takeuchi, JItadani, SHashimura, KIkura, MHigashino, MYasuhiro, TNagaura, T Trk-inhibiting compound US Patent  US9763943 Publication Date 9/19/2017 
Target
Name:
High affinity nerve growth factor receptor
Synonyms:
2.7.10.1 NTRK1 NTRK1_HUMAN Neurotrophic tyrosine kinase receptor type 1 Synonyms=MTC TRK1-transforming tyrosine kinase protein TRKA GN Trk-A Tropomyosin-related kinase A Tyrosine kinase receptor Tyrosine kinase receptor A Tyrosine kinase receptor A (Trk-A) gp140trk | p140-TrkA
Type:
Mol. Mass.:
87498.18
Organism:
Homo sapiens (Human)
Description:
P04629
Residue:
796
  
Inhibitor
Name:
BDBM249319
Synonyms:
US10300060, Example 9-1 US9463192, 9-1 US9993479, 9-1
Type:
Small organic molecule
Emp. Form.:
C27H19ClF3N7O2
Mol. Mass.:
565.934
SMILES:
Nc1ncc(Cl)cc1-c1ccc(Oc2ccc(NC(=O)Nc3cc(ccc3-n3cccn3)C(F)(F)F)cn2)cc1
: