Target
Ataxin-1
Ligand
BDBM321899
Substrate
Meas. Tech.
Biological Assay
IC50
3.50±n/a nM
Citation
 Beattie, DBaettig, ULegrand, DMLister, ASMcKenna, JPearce, DWSandham, DASteward, ORThomson, C Autotaxin inhibitors US Patent  US9763957 Publication Date 9/19/2017 
Target
Name:
Ataxin-1
Synonyms:
ATX1 ATXN1 | SCA1
Type:
Protein
Mol. Mass.:
86941.25
Organism:
Homo sapiens (Human)
Description:
P54253
Residue:
815
  
Inhibitor
Name:
BDBM321899
Synonyms:
(E)-Ethyl 1-((1-(3-(4-chloro-2-((5-methyl-2H-tetrazol-2-yl)methyl)phenyl)acryloyl)-4-hydroxypiperidin-4-yl)methyl)-1H-pyrazole-4-carboxylate US9763957, Example 32
Type:
Small organic molecule
Emp. Form.:
C24H28ClN7O4
Mol. Mass.:
513.977
SMILES:
CCOC(=O)c1cnn(CC2(O)CCN(CC2)C(=O)\C=C\c2ccc(Cl)cc2Cn2nnc(C)n2)c1
: