Target
Ataxin-1
Ligand
BDBM321925
Substrate
Meas. Tech.
Biological Assay
IC50
151±n/a nM
Citation
 Beattie, DBaettig, ULegrand, DMLister, ASMcKenna, JPearce, DWSandham, DASteward, ORThomson, C Autotaxin inhibitors US Patent  US9763957 Publication Date 9/19/2017 
Target
Name:
Ataxin-1
Synonyms:
ATX1 ATXN1 | SCA1
Type:
Protein
Mol. Mass.:
86941.25
Organism:
Homo sapiens (Human)
Description:
P54253
Residue:
815
  
Inhibitor
Name:
BDBM321925
Synonyms:
(E)-3-(4-Chloro-2-((5-methyl-2H-tetrazol-2-yl)methyl)phenyl)-1-(3-hydroxypiperidin-1-yl)prop-2-en-1-one US9763957, Example 49.7
Type:
Small organic molecule
Emp. Form.:
C17H20ClN5O2
Mol. Mass.:
361.826
SMILES:
Cc1nnn(Cc2cc(Cl)ccc2\C=C\C(=O)N2CCCC(O)C2)n1
: