Target
Ataxin-1
Ligand
BDBM321953
Substrate
Meas. Tech.
Biological Assay
IC50
4.20±n/a nM
Citation
 Beattie, DBaettig, ULegrand, DMLister, ASMcKenna, JPearce, DWSandham, DASteward, ORThomson, C Autotaxin inhibitors US Patent  US9763957 Publication Date 9/19/2017 
Target
Name:
Ataxin-1
Synonyms:
ATX1 ATXN1 | SCA1
Type:
Protein
Mol. Mass.:
86941.25
Organism:
Homo sapiens (Human)
Description:
P54253
Residue:
815
  
Inhibitor
Name:
BDBM321953
Synonyms:
(R,E)-3-(4-Chloro-2-((5-methyl-2H-tetrazol-2-yl)methyl)phenyl)-1-(2-methyl-4-((2-methyloxazol-4-yl)methyl)piperazin-1-yl)prop-2-en-1-one US9763957, Example 62
Type:
Small organic molecule
Emp. Form.:
C22H26ClN7O2
Mol. Mass.:
455.941
SMILES:
C[C@@H]1CN(Cc2coc(C)n2)CCN1C(=O)\C=C\c1ccc(Cl)cc1Cn1nnc(C)n1
: