Target
Ataxin-1
Ligand
BDBM322068
Substrate
Meas. Tech.
Biological Assay
IC50
5.30±n/a nM
Citation
 Beattie, DBaettig, ULegrand, DMLister, ASMcKenna, JPearce, DWSandham, DASteward, ORThomson, C Autotaxin inhibitors US Patent  US9763957 Publication Date 9/19/2017 
Target
Name:
Ataxin-1
Synonyms:
ATX1 ATXN1 | SCA1
Type:
Protein
Mol. Mass.:
86941.25
Organism:
Homo sapiens (Human)
Description:
P54253
Residue:
815
  
Inhibitor
Name:
BDBM322068
Synonyms:
(E)-N-(1-(3-(2-((5-Methyl-2H-tetrazol-2-yl)methyl)-4-(trifluoromethyl)phenyl) acryloyl) piperidin-4-yl)-6-(1H-1,2,3-triazol-5-yl)hexanamide US9763957, Example 156
Type:
Small organic molecule
Emp. Form.:
C26H32F3N9O2
Mol. Mass.:
559.5866
SMILES:
Cc1nnn(Cc2cc(ccc2\C=C\C(=O)N2CCC(CC2)NC(=O)CCCCCc2cnn[nH]2)C(F)(F)F)n1
: