Target
Indoleamine 2,3-dioxygenase 1
Ligand
BDBM50234069
Substrate
Meas. Tech.
IDO Kynurenine Assay
IC50
6180±n/a nM
Citation
 Markwalder, JASeitz, SPBalog, JAHuang, AMandal, SKWilliams, DKHart, ACInghrim, J IDO inhibitors US Patent  US9765018 Publication Date 9/19/2017 
Target
Name:
Indoleamine 2,3-dioxygenase 1
Synonyms:
I23O1_HUMAN IDO-1 INDO Indoleamine 2,3-dioxygenase | Indoleamine-pyrrole 2,3-dioxygenase
Type:
Enzyme
Mol. Mass.:
45330.80
Organism:
Homo sapiens (Human)
Description:
P14902
Residue:
403
  
Inhibitor
Name:
BDBM50234069
Synonyms:
CHEMBL4069208 | US9765018, Example 1
Type:
Small organic molecule
Emp. Form.:
C31H29ClN2O4
Mol. Mass.:
529.026
SMILES:
Cc1ccc(NC(=O)Nc2cc(ccc2Oc2ccccc2C(C)(C)C)-c2ccc(Cl)c(c2)C(O)=O)cc1
: