Target
Indoleamine 2,3-dioxygenase 1
Ligand
BDBM50234059
Substrate
Meas. Tech.
IDO Kynurenine Assay
IC50
1600±n/a nM
Citation
 Markwalder, JASeitz, SPBalog, JAHuang, AMandal, SKWilliams, DKHart, ACInghrim, J IDO inhibitors US Patent  US9765018 Publication Date 9/19/2017 
Target
Name:
Indoleamine 2,3-dioxygenase 1
Synonyms:
I23O1_HUMAN IDO-1 INDO Indoleamine 2,3-dioxygenase | Indoleamine-pyrrole 2,3-dioxygenase
Type:
Enzyme
Mol. Mass.:
45330.80
Organism:
Homo sapiens (Human)
Description:
P14902
Residue:
403
  
Inhibitor
Name:
BDBM50234059
Synonyms:
CHEMBL4087821 | US9765018, Example 63
Type:
Small organic molecule
Emp. Form.:
C31H30N2O5
Mol. Mass.:
510.5803
SMILES:
COc1ccc(cc1C(O)=O)-c1ccc(Oc2ccccc2C(C)C)c(NC(=O)Nc2ccc(C)cc2)c1
: