Target
Sodium channel protein type 9 subunit alpha
Ligand
BDBM176469
Substrate
Meas. Tech.
In Vitro Assay
IC50
140±40 nM
Citation
 Kyle, DNi, CPark, MTafesse, L Pyridine compounds as sodium channel blockers US Patent  US9765029 Publication Date 9/19/2017 
Target
Name:
Sodium channel protein type 9 subunit alpha
Synonyms:
NENA Peripheral sodium channel 1 SCN9A_HUMAN Voltage-gated sodium channel subunit Nav1.7 hNE-Na
Type:
Protein
Mol. Mass.:
226375.97
Organism:
Homo sapiens (Human)
Description:
Q15858
Residue:
1988
  
Inhibitor
Name:
BDBM176469
Synonyms:
US9120752, 12 | US9765029, 12
Type:
Small organic molecule
Emp. Form.:
C32H34FN3O5S
Mol. Mass.:
591.693
SMILES:
CC1(C)C2CCC1(CS(=O)(=O)N1CCN(CC1)C(=O)c1cccc(n1)-c1ccc(Oc3ccc(F)cc3)cc1)C(=O)C2
: