Target
Sodium channel protein type 9 subunit alpha
Ligand
BDBM176520
Substrate
Meas. Tech.
In Vitro Assay
IC50
6810±570 nM
Citation
 Kyle, DNi, CPark, MTafesse, L Pyridine compounds as sodium channel blockers US Patent  US9765029 Publication Date 9/19/2017 
Target
Name:
Sodium channel protein type 9 subunit alpha
Synonyms:
NENA Peripheral sodium channel 1 SCN9A_HUMAN Voltage-gated sodium channel subunit Nav1.7 hNE-Na
Type:
Protein
Mol. Mass.:
226375.97
Organism:
Homo sapiens (Human)
Description:
Q15858
Residue:
1988
  
Inhibitor
Name:
BDBM176520
Synonyms:
US9120752, 56 | US9765029, 56
Type:
Small organic molecule
Emp. Form.:
C23H19FN4O3S
Mol. Mass.:
450.485
SMILES:
Fc1ccc(cc1)-c1cccc(n1)C(=O)N1CCN(CC1)S(=O)(=O)c1cccc(c1)C#N
: