Target
Sodium channel protein type 9 subunit alpha
Ligand
BDBM176535
Substrate
Meas. Tech.
In Vitro Assay
IC50
1564±166 nM
Citation
 Kyle, DNi, CPark, MTafesse, L Pyridine compounds as sodium channel blockers US Patent  US9765029 Publication Date 9/19/2017 
Target
Name:
Sodium channel protein type 9 subunit alpha
Synonyms:
NENA Peripheral sodium channel 1 SCN9A_HUMAN Voltage-gated sodium channel subunit Nav1.7 hNE-Na
Type:
Protein
Mol. Mass.:
226375.97
Organism:
Homo sapiens (Human)
Description:
Q15858
Residue:
1988
  
Inhibitor
Name:
BDBM176535
Synonyms:
US9120752, 65 | US9765029, 65
Type:
Small organic molecule
Emp. Form.:
C26H28FN3O5
Mol. Mass.:
481.516
SMILES:
CC(C)C[C@H](NC(=O)c1cc(cc(n1)-c1ccc(Oc2ccc(F)cc2)cc1)[C@@H](O)CO)C(N)=O
: