Target
Calmodulin-domain protein kinase 1
Ligand
BDBM50345704
Substrate
Meas. Tech.
Biological Assay
IC50
15.0±n/a nM
Citation
 Van Voorhis, WCHol, WGLarson, ETMaly, DJMerritt, EOjo, KK Compositions and methods for treating toxoplasmosis, cryptosporidiosis, and other apicomplexan protozoan related diseases US Patent  US9765037 Publication Date 9/19/2017 
Target
Name:
Calmodulin-domain protein kinase 1
Synonyms:
Calmodulin-domain protein kinase 1 Calmodulin-domain protein kinase, putative
Type:
Enzyme Catalytic Domain
Mol. Mass.:
57248.42
Organism:
Toxoplasma gondii
Description:
Residue:
507
  
Inhibitor
Name:
BDBM50345704
Synonyms:
1-(tert-butyl)-3-(naphthalen-2-yl)-1H-pyrazolo[3,4-d]pyrimidin-4-amine (3) 1-tert-butyl-3-(naphthalen-2-yl)-1H-pyrazolo[3,4-d]pyrimidin-4-amine (3) CHEMBL1231371 US10544104, Compound 2 US9518026, Example 2 US9956214, Compound 2
Type:
Small organic molecule
Emp. Form.:
C19H19N5
Mol. Mass.:
317.3877
SMILES:
CC(C)(C)n1nc(-c2ccc3ccccc3c2)c2c(N)ncnc12
: