Target
Calmodulin-domain protein kinase 1
Ligand
BDBM50298225
Substrate
Meas. Tech.
Biological Assay
IC50
31.0±n/a nM
Citation
 Van Voorhis, WCHol, WGLarson, ETMaly, DJMerritt, EOjo, KK Compositions and methods for treating toxoplasmosis, cryptosporidiosis, and other apicomplexan protozoan related diseases US Patent  US9765037 Publication Date 9/19/2017 
Target
Name:
Calmodulin-domain protein kinase 1
Synonyms:
Calmodulin-domain protein kinase 1 Calmodulin-domain protein kinase, putative
Type:
Enzyme Catalytic Domain
Mol. Mass.:
57248.42
Organism:
Toxoplasma gondii
Description:
Residue:
507
  
Inhibitor
Name:
BDBM50298225
Synonyms:
CHEMBL2069955 NM-PP1 US11247972, Compound 5d | US9765037, Compound 5d
Type:
Small organic molecule
Emp. Form.:
C20H21N5
Mol. Mass.:
331.4142
SMILES:
CC(C)(C)n1nc(Cc2cccc3ccccc23)c2c(N)ncnc12
: