Target
Calmodulin-domain protein kinase 1
Ligand
BDBM50345739
Substrate
Meas. Tech.
Biological Assay
IC50
6.00±n/a nM
Citation
 Van Voorhis, WCHol, WGLarson, ETMaly, DJMerritt, EOjo, KK Compositions and methods for treating toxoplasmosis, cryptosporidiosis, and other apicomplexan protozoan related diseases US Patent  US9765037 Publication Date 9/19/2017 
Target
Name:
Calmodulin-domain protein kinase 1
Synonyms:
Calmodulin-domain protein kinase 1 Calmodulin-domain protein kinase, putative
Type:
Enzyme Catalytic Domain
Mol. Mass.:
57248.42
Organism:
Toxoplasma gondii
Description:
Residue:
507
  
Inhibitor
Name:
BDBM50345739
Synonyms:
1-isopropyl-3-(6-methoxynaphthalen-2-yl)-1H-pyrazolo[3,4-d]pyrimidin-4-amine CHEMBL2070045 US11247972, Compound 7q | US9765037, Compound 7q
Type:
Small organic molecule
Emp. Form.:
C19H19N5O
Mol. Mass.:
333.3871
SMILES:
COc1ccc2cc(ccc2c1)-c1nn(C(C)C)c2ncnc(N)c12
: