Target
Calmodulin-domain protein kinase 1
Ligand
BDBM50389688
Substrate
Meas. Tech.
Biological Assay
IC50
3.00±n/a nM
Citation
 Van Voorhis, WCHol, WGLarson, ETMaly, DJMerritt, EOjo, KK Compositions and methods for treating toxoplasmosis, cryptosporidiosis, and other apicomplexan protozoan related diseases US Patent  US9765037 Publication Date 9/19/2017 
Target
Name:
Calmodulin-domain protein kinase 1
Synonyms:
Calmodulin-domain protein kinase 1 Calmodulin-domain protein kinase, putative
Type:
Enzyme Catalytic Domain
Mol. Mass.:
57248.42
Organism:
Toxoplasma gondii
Description:
Residue:
507
  
Inhibitor
Name:
BDBM50389688
Synonyms:
CHEMBL2069315 US11247972, Compound 36 | US9765037, Compound 36
Type:
Small organic molecule
Emp. Form.:
C24H26N6O
Mol. Mass.:
414.5028
SMILES:
Nc1ncnc2n(CC3CCNCC3)nc(-c3ccc4cc(OCC=C)ccc4c3)c12
: