Target
Calcium-dependent protein kinase 1
Ligand
BDBM50389700
Substrate
Meas. Tech.
Biological Assay
IC50
0.600±n/a nM
Citation
 Van Voorhis, WCHol, WGLarson, ETMaly, DJMerritt, EOjo, KK Compositions and methods for treating toxoplasmosis, cryptosporidiosis, and other apicomplexan protozoan related diseases US Patent  US9765037 Publication Date 9/19/2017 
Target
Name:
Calcium-dependent protein kinase 1
Synonyms:
Calcium-dependent protein kinase 1 (CDPK1)
Type:
Protein
Mol. Mass.:
76617.33
Organism:
Cryptosporidium parvum
Description:
Q6S4W0
Residue:
677
  
Inhibitor
Name:
BDBM50389700
Synonyms:
CHEMBL2070067 US11247972, Compound 38 | US9765037, Compound 38
Type:
Small organic molecule
Emp. Form.:
C28H27ClN6O
Mol. Mass.:
499.007
SMILES:
Nc1ncnc2n(CC3CCNCC3)nc(-c3ccc4cc(OCc5cccc(Cl)c5)ccc4c3)c12
: