Target
Calcium-dependent protein kinase 1
Ligand
BDBM50389695
Substrate
Meas. Tech.
Biological Assay
IC50
49.7±n/a nM
Citation
 Van Voorhis, WCHol, WGLarson, ETMaly, DJMerritt, EOjo, KK Compositions and methods for treating toxoplasmosis, cryptosporidiosis, and other apicomplexan protozoan related diseases US Patent  US9765037 Publication Date 9/19/2017 
Target
Name:
Calcium-dependent protein kinase 1
Synonyms:
Calcium-dependent protein kinase 1 (CDPK1)
Type:
Protein
Mol. Mass.:
76617.33
Organism:
Cryptosporidium parvum
Description:
Q6S4W0
Residue:
677
  
Inhibitor
Name:
BDBM50389695
Synonyms:
CHEMBL2070062 US11247972, Compound 40 | US9765037, Compound 40
Type:
Small organic molecule
Emp. Form.:
C25H23N5O
Mol. Mass.:
409.483
SMILES:
CC(C)n1nc(-c2ccc3cc(OCc4ccccc4)ccc3c2)c2c(N)ncnc12
: