Target
Calmodulin-domain protein kinase 1
Ligand
BDBM50389694
Substrate
Meas. Tech.
Biological Assay
IC50
0.900±n/a nM
Citation
 Van Voorhis, WCHol, WGLarson, ETMaly, DJMerritt, EOjo, KK Compositions and methods for treating toxoplasmosis, cryptosporidiosis, and other apicomplexan protozoan related diseases US Patent  US9765037 Publication Date 9/19/2017 
Target
Name:
Calmodulin-domain protein kinase 1
Synonyms:
Calmodulin-domain protein kinase 1 Calmodulin-domain protein kinase, putative
Type:
Enzyme Catalytic Domain
Mol. Mass.:
57248.42
Organism:
Toxoplasma gondii
Description:
Residue:
507
  
Inhibitor
Name:
BDBM50389694
Synonyms:
CHEMBL2070060 US11247972, Compound 42 | US9765037, Compound 42
Type:
Small organic molecule
Emp. Form.:
C22H25N5O
Mol. Mass.:
375.4668
SMILES:
CCCCOc1ccc2cc(ccc2c1)-c1nn(C(C)C)c2ncnc(N)c12
: