Target
Tyrosine-protein kinase ABL1
Ligand
BDBM50345717
Substrate
Meas. Tech.
Inhibition Assay
IC50
360±n/a nM
Citation
 Van Voorhis, WCHol, WGLarson, ETMaly, DJMerritt, EOjo, KK Compositions and methods for treating toxoplasmosis, cryptosporidiosis, and other apicomplexan protozoan related diseases US Patent  US9765037 Publication Date 9/19/2017 
Target
Name:
Tyrosine-protein kinase ABL1
Synonyms:
ABL ABL1_HUMAN JTK7 Proto-oncogene tyrosine-protein kinase ABL1 Tyrosine-protein kinase ABL V-abl Abelson murine leukemia viral oncogene homolog 1 p150 | tyrosine-protein kinase ABL1 isoform a
Type:
Enzyme
Mol. Mass.:
122897.30
Organism:
Homo sapiens (Human)
Description:
P00519
Residue:
1130
  
Inhibitor
Name:
BDBM50345717
Synonyms:
1-(1-ethylpiperidin-4-yl)-3-(naphthalen-1-ylmethyl)-1H-pyrazolo[3,4-d]pyrimidin-4-amine US10544104, Compound 5m US9765037, Compound 5m
Type:
Small organic molecule
Emp. Form.:
C23H26N6
Mol. Mass.:
386.4927
SMILES:
CCN1CCC(CC1)n1nc(Cc2cccc3ccccc23)c2c(N)ncnc12
: