Target
Proto-oncogene tyrosine-protein kinase Src
Ligand
BDBM50345739
Substrate
Meas. Tech.
Inhibition Assay
IC50
770±n/a nM
Citation
 Van Voorhis, WCHol, WGLarson, ETMaly, DJMerritt, EOjo, KK Compositions and methods for treating toxoplasmosis, cryptosporidiosis, and other apicomplexan protozoan related diseases US Patent  US9765037 Publication Date 9/19/2017 
Target
Name:
Proto-oncogene tyrosine-protein kinase Src
Synonyms:
Calmodulin/Proto-oncogene tyrosine-protein kinase Src Proto-oncogene c-Src SRC SRC_HUMAN V-src sarcoma (Schmidt-Ruppin A-2) viral oncogene homolog (avian) p60-Src | pp60c-src
Type:
Protein
Mol. Mass.:
59838.60
Organism:
Homo sapiens (Human)
Description:
P12931
Residue:
536
  
Inhibitor
Name:
BDBM50345739
Synonyms:
1-isopropyl-3-(6-methoxynaphthalen-2-yl)-1H-pyrazolo[3,4-d]pyrimidin-4-amine CHEMBL2070045 US11247972, Compound 7q | US9765037, Compound 7q
Type:
Small organic molecule
Emp. Form.:
C19H19N5O
Mol. Mass.:
333.3871
SMILES:
COc1ccc2cc(ccc2c1)-c1nn(C(C)C)c2ncnc(N)c12
: