Target
Epidermal growth factor receptor
Ligand
BDBM202378
Substrate
Meas. Tech.
Biochemical Assay
IC50
65.0±n/a nM
Citation
 Lee, KNiu, DPetter, RCSingh, J Heteroaryl compounds and uses thereof US Patent  US9765038 Publication Date 9/19/2017 
Target
Name:
Epidermal growth factor receptor
Synonyms:
EGF Receptor Substrate EGFR_HUMAN ERBB1 Epidermal Growth Factor Receptor erbB-1 Epidermal growth factor receptor (EGFR) HER1 Proto-oncogene c-ErbB-1 Tyrosine-Protein Kinase ErbB-1
Type:
Receptor Kinase Domain
Mol. Mass.:
134279.59
Organism:
Homo sapiens (Human)
Description:
P00533
Residue:
1210
  
Inhibitor
Name:
BDBM202378
Synonyms:
US10081606, Compound I-10 US9765038, Compound I-10
Type:
Small organic molecule
Emp. Form.:
C23H21F3N4O5
Mol. Mass.:
490.4318
SMILES:
COc1ccc(Nc2ncc(c(Oc3cccc(NC(=O)C=C)c3)n2)C(F)(F)F)c(OC)c1OC
: