Target
cGMP-dependent 3',5'-cyclic phosphodiesterase
Ligand
BDBM204665
Substrate
Meas. Tech.
Inhibition of Recombinant PDE2A
IC50
3.00±n/a nM
Citation
 Lankau, HLangen, BGrunwald, CHoefgen, NStange, HDost, REgerland, U (1,2,4)triazolo[4,3-A]quinoxaline derivatives as inhibitors of phosphodiesterases US Patent  US9540379 Publication Date 1/10/2017 
Target
Name:
cGMP-dependent 3',5'-cyclic phosphodiesterase
Synonyms:
CGS-PDE Homo sapiens phosphodiesterase 2A (PDE2A) PDE2A cGSPDE
Type:
Enzyme Catalytic Domain
Mol. Mass.:
105691.58
Organism:
Homo sapiens (Human)
Description:
O00408
Residue:
941
  
Inhibitor
Name:
BDBM204665
Synonyms:
1-(5-butoxy-2-fluoro-phenyl)-4-methyl-8-trifluoromethyl-[1,2,4]triazoo[4,3-a]quinoxaline | US9540379, 67
Type:
Small organic molecule
Emp. Form.:
C21H18F4N4O
Mol. Mass.:
418.3874
SMILES:
CCCCOc1ccc(F)c(c1)-c1nnc2c(C)nc3ccc(cc3n12)C(F)(F)F
: