Target
Histone deacetylase 4
Ligand
BDBM50446477
Substrate
Meas. Tech.
Inhibition Assay
IC50
540±n/a nM
Citation
 Bürli, RWStott, AJBreccia, PDominguez, CMuñoz-Sanjuàn, ILuckhurst, CAHughes, SJHaughan, AF Histone deacetylase inhibitors and compositions and methods of use thereof US Patent  US9765054 Publication Date 9/19/2017 
Target
Name:
Histone deacetylase 4
Synonyms:
Cereblon/Histone deacetylase 4 HDAC4 Histone acetylase 4(HDAC4) KIAA0288
Type:
Enzyme
Mol. Mass.:
119049.39
Organism:
Homo sapiens (Human)
Description:
P56524
Residue:
1084
  
Inhibitor
Name:
BDBM50446477
Synonyms:
CHEMBL3110023 | US9765054, Compound 25b
Type:
Small organic molecule
Emp. Form.:
C14H15N3O2
Mol. Mass.:
257.2878
SMILES:
Cn1cc(cn1)[C@H]1[C@@H]([C@@H]1c1ccccc1)C(=O)NO
: