Target
Mitogen-activated protein kinase kinase kinase 9
Ligand
BDBM14178
Substrate
myelin basic protein
Meas. Tech.
Mixed-Lineage Kinase Assays
pH
7.2±n/a
Temperature
310.15±n/a K
IC50
1106±n/a nM
Citation
 Hudkins, RLJohnson, NWAngeles, TSGessner, GWMallamo, JP Synthesis and mixed lineage kinase activity of pyrrolocarbazole and isoindolone analogs of (+)K-252a. J Med Chem 50:433-41 (2007)  
Target
Name:
Mitogen-activated protein kinase kinase kinase 9
Synonyms:
M3K9_HUMAN MLK1 Mitogen-activated protein kinase kinase kinase 9 (MLK1) PRKE1
Type:
protein
Mol. Mass.:
121881.51
Organism:
Homo sapiens (Human)
Description:
P80192
Residue:
1104
  
Inhibitor
Name:
BDBM14178
Synonyms:
12,13-dihydro-6H,7H,14H-naphthyl-[3,4-a]pyrrolo[3,4-c]carbazole-5(5H)one JMC515680 Compound 4 | Pyrrolocarbazole Analog 9
Type:
Small organic molecule
Emp. Form.:
C22H16N2O
Mol. Mass.:
324.3752
SMILES:
O=C1NCc2c1c-1c(CCc3ccccc-13)c1[nH]c3ccccc3c21
:
Substrate
Name:
myelin basic protein
Synonyms:
MBP Myelin A1 protein biotin-MBP protein | biotin-myelin basic protein
Type:
Other Protein Type
Mol. Mass.:
33133.33
Organism:
Homo sapiens (Human)
Description:
Residue:
304