Target
Mitogen-activated protein kinase kinase kinase 9
Ligand
BDBM14188
Substrate
myelin basic protein
Meas. Tech.
Mixed-Lineage Kinase Assays
pH
7.2±n/a
Temperature
310.15±n/a K
IC50
68±n/a nM
Citation
 Hudkins, RLJohnson, NWAngeles, TSGessner, GWMallamo, JP Synthesis and mixed lineage kinase activity of pyrrolocarbazole and isoindolone analogs of (+)K-252a. J Med Chem 50:433-41 (2007)  
Target
Name:
Mitogen-activated protein kinase kinase kinase 9
Synonyms:
M3K9_HUMAN MLK1 Mitogen-activated protein kinase kinase kinase 9 (MLK1) PRKE1
Type:
protein
Mol. Mass.:
121881.51
Organism:
Homo sapiens (Human)
Description:
P80192
Residue:
1104
  
Inhibitor
Name:
BDBM14188
Synonyms:
3-thia-13,23-diazahexacyclo[14.7.0.0^{2,10}.0^{4,9}.0^{11,15}.0^{17,22}]tricosa-1(16),2(10),4(9),5,7,11(15),17(22),18,20-nonaene-12,14-dione Imide Analog 15
Type:
Small organic molecule
Emp. Form.:
C20H10N2O2S
Mol. Mass.:
342.371
SMILES:
O=C1NC(=O)c2c1c1c3ccccc3[nH]c1c1sc3ccccc3c21
:
Substrate
Name:
myelin basic protein
Synonyms:
MBP Myelin A1 protein biotin-MBP protein | biotin-myelin basic protein
Type:
Other Protein Type
Mol. Mass.:
33133.33
Organism:
Homo sapiens (Human)
Description:
Residue:
304