Target
Mitogen-activated protein kinase kinase kinase 11
Ligand
BDBM14174
Substrate
myelin basic protein
Meas. Tech.
Mixed-Lineage Kinase Assays
IC50
22±n/a nM
Citation
 Hudkins, RLJohnson, NWAngeles, TSGessner, GWMallamo, JP Synthesis and mixed lineage kinase activity of pyrrolocarbazole and isoindolone analogs of (+)K-252a. J Med Chem 50:433-41 (2007)  
Target
Name:
Mitogen-activated protein kinase kinase kinase 11
Synonyms:
M3K11_HUMAN MLK3 Mixed Lineage Kinase 3 (MLK3) SPRK
Type:
PROTEIN
Mol. Mass.:
92696.93
Organism:
Homo sapiens (Human)
Description:
ChEMBL_1460565
Residue:
847
  
Inhibitor
Name:
BDBM14174
Synonyms:
12,13-Dihydro-5H,6H,14H-naphthy[3,4-a]pyrrolo[3,4-c]carbazole-7(7H)one Pyrrolocarbazole Analog 8
Type:
Small organic molecule
Emp. Form.:
C22H16N2O
Mol. Mass.:
324.3752
SMILES:
O=C1NCc2c1c1c([nH]c3ccccc13)c1CCc3ccccc3-c21
:
Substrate
Name:
myelin basic protein
Synonyms:
MBP Myelin A1 protein biotin-MBP protein | biotin-myelin basic protein
Type:
Other Protein Type
Mol. Mass.:
33133.33
Organism:
Homo sapiens (Human)
Description:
Residue:
304