Target
Mitogen-activated protein kinase kinase kinase 10
Ligand
BDBM14186
Substrate
myelin basic protein
Meas. Tech.
Mixed-Lineage Kinase Assays
IC50
339±n/a nM
Citation
 Hudkins, RLJohnson, NWAngeles, TSGessner, GWMallamo, JP Synthesis and mixed lineage kinase activity of pyrrolocarbazole and isoindolone analogs of (+)K-252a. J Med Chem 50:433-41 (2007)  
Target
Name:
Mitogen-activated protein kinase kinase kinase 10
Synonyms:
M3K10_HUMAN MLK2 Mitogen-activated protein kinase kinase kinase 10 | Mixed Lineage Kinase 2 (MLK2)
Type:
PROTEIN
Mol. Mass.:
103699.30
Organism:
Homo sapiens (Human)
Description:
ChEMBL_1460564
Residue:
954
  
Inhibitor
Name:
BDBM14186
Synonyms:
12,13-Dihydro-6H,14H-naphthyl[3,4-a]pyrrolo[3,4-c]carbazole-5,7(5H,7H)dione Imide Analog 7
Type:
Small organic molecule
Emp. Form.:
C22H14N2O2
Mol. Mass.:
338.3588
SMILES:
O=C1NC(=O)c2c1c-1c(CCc3ccccc-13)c1[nH]c3ccccc3c21
:
Substrate
Name:
myelin basic protein
Synonyms:
MBP Myelin A1 protein biotin-MBP protein | biotin-myelin basic protein
Type:
Other Protein Type
Mol. Mass.:
33133.33
Organism:
Homo sapiens (Human)
Description:
Residue:
304