Target
Apoptosis regulator Bcl-2
Ligand
BDBM341046
Substrate
Meas. Tech.
Fluorescence Polarisation Assay
IC50
10000±n/a nM
Citation
 Casara, PLe Diguarher, THenlin, JStarck, JLe Tiran, ADe Nanteuil, GGeneste, ODavidson, JEMurray, JBChen, IWalmsley, CGraham, CJRay, SMaddox, DBedford, S Indole and pyrrole compounds, a process for their preparation and pharmaceutical compositions containing them US Patent  US9765056 Publication Date 9/19/2017 
Target
Name:
Apoptosis regulator Bcl-2
Synonyms:
Apoptosis regulator Bcl-2 Protein BCL-2 BCL2_HUMAN | Bcl-2 Protein
Type:
Homodimer or heterodimer
Mol. Mass.:
26269.11
Organism:
Homo sapiens (Human)
Description:
P10415
Residue:
239
  
Inhibitor
Name:
BDBM341046
Synonyms:
N-(4-Methylphenyl)-1-(6-{[(3S)-3-[(4-methylpiperazin-1-yl)methyl]-3,4-dihydroisoquinolin-2(1H)-yl]carbonyl}-1,3-benzodioxol-5-yl)-N-(piperidin-4-yl)-1H-indole-3-carboxamide bis-hydrochloride | US9765056, Example 98
Type:
Small organic molecule
Emp. Form.:
C44H48N6O4
Mol. Mass.:
724.8897
SMILES:
CN1CCN(C[C@@H]2Cc3ccccc3CN2C(=O)c2cc3OCOc3cc2-n2cc(C(=O)N(C3CCNCC3)c3ccc(C)cc3)c3ccccc23)CC1
: