Target
Apoptosis regulator Bcl-2
Ligand
BDBM341095
Substrate
Meas. Tech.
Fluorescence Polarisation Assay
IC50
10.2±n/a nM
Citation
 Casara, PLe Diguarher, THenlin, JStarck, JLe Tiran, ADe Nanteuil, GGeneste, ODavidson, JEMurray, JBChen, IWalmsley, CGraham, CJRay, SMaddox, DBedford, S Indole and pyrrole compounds, a process for their preparation and pharmaceutical compositions containing them US Patent  US9765056 Publication Date 9/19/2017 
Target
Name:
Apoptosis regulator Bcl-2
Synonyms:
Apoptosis regulator Bcl-2 Protein BCL-2 BCL2_HUMAN | Bcl-2 Protein
Type:
Homodimer or heterodimer
Mol. Mass.:
26269.11
Organism:
Homo sapiens (Human)
Description:
P10415
Residue:
239
  
Inhibitor
Name:
BDBM341095
Synonyms:
1-{5-Chloro-2-[(3S)-3-[(4-methylpiperazin-1-yl)methyl]-1,2,3,4-tetrahydroisoquinoline-2-carbonyl]phenyl}-N-(4-hydroxyphenyl)-N-phenyl-1H-indole-3-carboxamide | US9765056, Example 159
Type:
Small organic molecule
Emp. Form.:
C43H40ClN5O3
Mol. Mass.:
710.262
SMILES:
CN1CCN(C[C@@H]2Cc3ccccc3CN2C(=O)c2ccc(Cl)cc2-n2cc(C(=O)N(c3ccccc3)c3ccc(O)cc3)c3ccccc23)CC1
: