Target
Orexin/Hypocretin receptor type 1
Ligand
BDBM341139
Substrate
Meas. Tech.
FLIPR Ca2+ Flux Assay
IC50
888±n/a nM
Citation
 Kuduk, SDSkudlarek, JW 3-ester-4 substituted orexin receptor antagonists US Patent  US9765057 Publication Date 9/19/2017 
Target
Name:
Orexin/Hypocretin receptor type 1
Synonyms:
HCRTR1 OX1R_HUMAN Orexin receptor type 1 (OR 1) Orexin receptor type 1 (OX1) Orexin receptor type 1 (OxR1) | Ox1r
Type:
Protein
Mol. Mass.:
47554.50
Organism:
Homo sapiens (Human)
Description:
O43613
Residue:
425
  
Inhibitor
Name:
BDBM341139
Synonyms:
US9765057, 6 | methyl 2-({(3R,6R)-1-[(4-fluoro-2- pyrimidin-2-ylphenyl)carbonyl]-6- methylpiperidin-3-yl}oxy)-4- (methylsulfanyl)pyridine-3- carboxylate
Type:
Small organic molecule
Emp. Form.:
C25H25FN4O4S
Mol. Mass.:
496.554
SMILES:
COC(=O)c1c(SC)ccnc1O[C@@H]1CC[C@@H](C)N(C1)C(=O)c1ccc(F)cc1-c1ncccn1
: