Target
Orexin receptor type 2
Ligand
BDBM341146
Substrate
Meas. Tech.
FLIPR Ca2+ Flux Assay
IC50
530±n/a nM
Citation
 Kuduk, SDSkudlarek, JW 3-ester-4 substituted orexin receptor antagonists US Patent  US9765057 Publication Date 9/19/2017 
Target
Name:
Orexin receptor type 2
Synonyms:
HCRTR2 OX2R_HUMAN Orexin receptor type 2 (OR-2) Orexin receptor type 2 (OX2R) Ox-2-R | Ox2-R
Type:
Protein
Mol. Mass.:
50710.53
Organism:
Homo sapiens (Human)
Description:
O43614
Residue:
444
  
Inhibitor
Name:
BDBM341146
Synonyms:
US9765057, 13 | methyl 4-cyclopropyl-2-{[(3R,6R)-6- methyl-1-{[2-(2H-1,2,3-triazol-2- yl)phenyl]carbonyl}piperidin-3- yl]oxy}pyridine-3-carboxylate
Type:
Small organic molecule
Emp. Form.:
C25H27N5O4
Mol. Mass.:
461.513
SMILES:
COC(=O)c1c(O[C@@H]2CC[C@@H](C)N(C2)C(=O)c2ccccc2-n2nccn2)nccc1C1CC1
: