Target
Orexin/Hypocretin receptor type 1
Ligand
BDBM341150
Substrate
Meas. Tech.
FLIPR Ca2+ Flux Assay
IC50
172±n/a nM
Citation
 Kuduk, SDSkudlarek, JW 3-ester-4 substituted orexin receptor antagonists US Patent  US9765057 Publication Date 9/19/2017 
Target
Name:
Orexin/Hypocretin receptor type 1
Synonyms:
HCRTR1 OX1R_HUMAN Orexin receptor type 1 (OR 1) Orexin receptor type 1 (OX1) Orexin receptor type 1 (OxR1) | Ox1r
Type:
Protein
Mol. Mass.:
47554.50
Organism:
Homo sapiens (Human)
Description:
O43613
Residue:
425
  
Inhibitor
Name:
BDBM341150
Synonyms:
Ethyl 4-ethyl-2-{[(3R,6R)-6-methyl-1-{[2-(2H-1,2,3-triazol-2-yl)phenyl]carbonyl}piperidin-3-yl]oxy}pyridine-3-carboxylate | US9765057, 17
Type:
Small organic molecule
Emp. Form.:
C25H29N5O4
Mol. Mass.:
463.5289
SMILES:
CCOC(=O)c1c(CC)ccnc1O[C@@H]1CC[C@@H](C)N(C1)C(=O)c1ccccc1-n1nccn1
: