Target
Tyrosine-protein phosphatase non-receptor type 1 [1-298]
Ligand
BDBM14212
Substrate
BDBM13466
Meas. Tech.
Enzymatic Assay
pH
7±n/a
Temperature
295.15±n/a K
Ki
860000±n/a nM
Citation
 Moretto, AFKirincich, SJXu, WXSmith, MJWan, ZKWilson, DPFollows, BCBinnun, EJoseph-McCarthy, DForeman, KErbe, DVZhang, YLTam, SKTam, SYLee, J Bicyclic and tricyclic thiophenes as protein tyrosine phosphatase 1B inhibitors. Bioorg Med Chem 14:2162-77 (2006)  
Target
Name:
Tyrosine-protein phosphatase non-receptor type 1 [1-298]
Synonyms:
PTN1_HUMAN PTP1B PTPase 1B Tyrosine-protein phosphatase, non-receptor type 1
Type:
Enzyme
Mol. Mass.:
34670.65
Organism:
Homo sapiens (Human)
Description:
The catalytic domain of PTP 1B (residues 1-298) was expressed and purified from E. coli.
Residue:
298
  
Inhibitor
Name:
BDBM14212
Synonyms:
3-(carboxymethoxy)naphthalene-2-carboxylic acid | Naphthoate compound 2
Type:
Small organic molecule
Emp. Form.:
C13H10O5
Mol. Mass.:
246.2155
SMILES:
OC(=O)COc1cc2ccccc2cc1C(O)=O
:
Substrate
Name:
BDBM13466
Synonyms:
4-Nitrophenyl phosphate disodium salt hexahydrate disodium (4-nitrophenyl) phosphate | para-nitrophenyl phosphate (pNPP)
Type:
Small organic molecule
Emp. Form.:
C6H4NO6P
Mol. Mass.:
217.0739
SMILES:
[O-][N+](=O)c1ccc(O[P+]([O-])([O-])[O-])cc1
: